BDBM50031353 CHEMBL3358101
SMILES O=C(NCCCCN1CCN(CC1)c1ccccc1)c1cc2ccccc2cn1
InChI Key InChIKey=OTTGJZVMJFEQJT-UHFFFAOYSA-N
Data  5 KI
  Tab Delimited (TSV)   2D SDfile   Computed 3D by Vconf -m prep SDfile
Find this compound or compounds like it in BindingDB:
Activity Spreadsheet -- Enzyme Inhibition Constant Data from BindingDB
Found 1 hit for monomerid = 50031353
TargetD(3) dopamine receptor(Homo sapiens (Human))
Universit£
Curated by ChEMBL
LigandPNGBDBM50031353(CHEMBL3358101)
Affinity DataKi:  12nM. Assay description: Binding affinity to dopamine D3 receptor (unknown origin)
In DepthDetails ArticlePubMed